Philipp Marek wrote, On 07/09/06 14:49:
On Sunday 03 September 2006 07:00 Benjamin M. wrote:
  
An error occurred at 23:56:14.027: No such file or directory (2)
  in main: cannot chdir to "-m"
FSVS (licensed under the GPLv2), (C) by Ph. Marek; version trunk:396
make[3]: *** [prepare_wc1] Error 1
make[2]: *** [prepare_clean] Error 2
make[1]: *** [/tmp/fsvs-test-501/default-repository] Error 2
make: *** [run-tests] Error 2
    
Hello Ben,

could you please re-try the tests?
Thank you very much!
  
Here the result:

$ svn update
At revision 431.

$ export WAA=/tmp/WAA/

$ find /tmp/WAA/
/tmp/WAA/

$ make run-tests VERBOSE=1
make -C test BINARY=/Users/benjamin/fsvs/fsvs/src/fsvs
Preparing default repository.
rm: /tmp/WAA//1d/c5/de2973b03ff84e6d1384eddb9e97//*: No such file or directory
rm: /tmp/WAA//b3/d8/4f6a3122d79527ddd33486ddcff8//*: No such file or directory
chmod: blabla: Operation not permitted
make[1]: *** [/tmp/fsvs-test-501/default-repository] Error 1
make: *** [run-tests] Error 2

$ find /tmp/WAA/
/tmp/WAA/
/tmp/WAA//77
/tmp/WAA//77/18
/tmp/WAA//77/18/fab35d7bd4f8a2a025227e633bde
/tmp/WAA//77/18/fab35d7bd4f8a2a025227e633bde/_base
/tmp/WAA//77/18/fab35d7bd4f8a2a025227e633bde/dir
/tmp/WAA//77/18/fab35d7bd4f8a2a025227e633bde/urls
/tmp/WAA//a3
/tmp/WAA//a3/cf
/tmp/WAA//a3/cf/b6c26c51c694db84b4a38608bbc3
/tmp/WAA//a3/cf/b6c26c51c694db84b4a38608bbc3/_base
/tmp/WAA//a3/cf/b6c26c51c694db84b4a38608bbc3/dir
/tmp/WAA//a3/cf/b6c26c51c694db84b4a38608bbc3/urls

$ make run-tests VERBOSE=1
make -C test BINARY=/Users/benjamin/fsvs/fsvs/src/fsvs
Preparing default repository.
rm: /tmp/WAA//1d/c5/de2973b03ff84e6d1384eddb9e97//*: No such file or directory


An error occurred at 15:04:50.808: Invalid argument (22)
  in cs__char2md5: Illegal hex char in high nibble: x
  in ops__load_1entry: Parsing the md5 failed
  in waa__input_tree
  in waa__read_or_build_tree
  in ci__work
  in main: action commit failed
FSVS (licensed under the GPLv2), (C) by Ph. Marek; version trunk:396
make[3]: *** [prepare_wc1] Error 1
make[2]: *** [prepare_clean] Error 2
make[1]: *** [/tmp/fsvs-test-501/default-repository] Error 2
make: *** [run-tests] Error 2

Ben.