Ph. Marek wrote, On 08/09/06 03:23:
$ make run-tests VERBOSE=1
    
...
  
chmod: blabla: Operation not permitted
make[1]: *** [/tmp/fsvs-test-501/default-repository] Error 1
make: *** [run-tests] Error 2
    
Hello Ben,

I now rewrote the test to optionally *not* try to use a set-gid-file.

How about now?
  
Below the result.

For the seq command error... it isn't installed by default... I can install it or do you prefer to find a workaround?

Ben.

~~~~~~~~~~~~

$ svn update
At revision 435.

$ find /tmp/WAA/
/tmp/WAA/

$ export WAA=/tmp/WAA

$ make run-tests VERBOSE=1
make -C test BINARY=/Users/benjamin/fsvs/fsvs/src/fsvs
Preparing default repository.
rm: /tmp/WAA/1d/c5/de2973b03ff84e6d1384eddb9e97//*: No such file or directory
rm: /tmp/WAA/b3/d8/4f6a3122d79527ddd33486ddcff8//*: No such file or directory
chmod: blabla: Operation not permitted
/Users/benjamin/fsvs/fsvs/src/test/001_init_dir: line 24: seq: command not found
make[1]: *** [/tmp/fsvs-test-501/default-repository] Error 127
make: *** [run-tests] Error 2

$ find /tmp/WAA/
/tmp/WAA/
/tmp/WAA//77
/tmp/WAA//77/18
/tmp/WAA//77/18/fab35d7bd4f8a2a025227e633bde
/tmp/WAA//77/18/fab35d7bd4f8a2a025227e633bde/_base
/tmp/WAA//77/18/fab35d7bd4f8a2a025227e633bde/dir
/tmp/WAA//77/18/fab35d7bd4f8a2a025227e633bde/urls
/tmp/WAA//a3
/tmp/WAA//a3/cf
/tmp/WAA//a3/cf/b6c26c51c694db84b4a38608bbc3
/tmp/WAA//a3/cf/b6c26c51c694db84b4a38608bbc3/_base
/tmp/WAA//a3/cf/b6c26c51c694db84b4a38608bbc3/dir
/tmp/WAA//a3/cf/b6c26c51c694db84b4a38608bbc3/urls

$ make run-tests VERBOSE=1
make -C test BINARY=/Users/benjamin/fsvs/fsvs/src/fsvs
Preparing default repository.
rm: /tmp/WAA/1d/c5/de2973b03ff84e6d1384eddb9e97//*: No such file or directory


An error occurred at 14:08:58.072: Invalid argument (22)
  in cs__char2md5: Illegal hex char in high nibble: x
  in ops__load_1entry: Parsing the md5 failed
  in waa__input_tree
  in waa__read_or_build_tree
  in ci__work
  in main: action commit failed
FSVS (licensed under the GPLv2), (C) by Ph. Marek; version trunk:396
make[3]: *** [prepare_wc1] Error 1
make[2]: *** [prepare_clean] Error 2
make[1]: *** [/tmp/fsvs-test-501/default-repository] Error 2
make: *** [run-tests] Error 2