Login | Register
My pages Projects Community openCollabNet

Discussions > dev > FSVS 1.1.14 and up and CentOS 4.4: Error on make run-tests

fsvs
Discussion topic

Back to topic list

FSVS 1.1.14 and up and CentOS 4.4: Error on make run-tests

Author benjaminm
Full name Benjamin M.
Date 2008-05-01 14:45:48 PDT
Message Phil,

With versions 1.1.14 and up (no problem with previous
versions) and CentOS 4.4 (no problem with CentOS 5) I have the following
error on

$ make run-tests

All tests are failing (I tried some with TEST_LIST=) with the same error.

Ben.



~~~~~~~~~~~~~~~~~~~~​~~~~~~~~~~~~~~~~~~~~​~~~~~~~~~~~~~~~~~~~~​~~~~~~~~~~~~
with /tmp/fsvs-test-0 already existing from previous working run-tests
~~~~~~~~~~~~~~~~~~~~​~~~~~~~~~~~~~~~~~~~~​~~~~~~~~~~~~~~~~~~~~​~~~~~~~~~~~

  make run-tests VERBOSE=1
make -C ../tests BINARY=/usr/src/fsvs​-1.1.14/src/fsvs
Running tests...

____________________​____________________​_______________
   "001_init_dir":1: (Thu May 1 17:34:42 EDT 2008)
+ alias 'rm=rm -i'
+ alias 'cp=cp -i'
+ alias 'mv=mv -i'
+ '[' -f /etc/bashrc ']'
+ . /etc/bashrc
+++ id -gn
+++ id -un
+++ id -u
++ '[' root = root -a 0 -gt 99 ']'
++ umask 022
++ '[' '' ']'
++ shopt -q login_shell
++ for i in '/etc/profile.d/*.sh'
++ '[' -r /etc/profile.d/colorls.sh ']'
++ . /etc/profile.d/colorls.sh
+++ alias 'll=ls -l'
+++ alias 'l.=ls -d .*'
+++ COLORS=/etc/DIR_COLORS
+++ '[' -e /etc/DIR_COLORS.xterm-color ']'
+++ '[' -e /root/.dircolors ']'
+++ '[' -e /root/.dircolors.xterm-color ']'
+++ '[' -e /root/.dir_colors ']'
+++ '[' -e /root/.dir_colors.xterm-color ']'
+++ '[' -e /etc/DIR_COLORS ']'
++++ dircolors --sh /etc/DIR_COLORS
+++ eval
'LS_COLORS='\''no=0​0:fi=00:di=01;34:ln=​01;36:pi=40;33:so=01​;35:bd=40;33;01:cd=4​0;33;01:or=01;05;37;​41:mi=01;05;37;41:ex​=01;32:*.cmd=01;32:*​.exe=01;32:*.com=01;​32:*.btm=01;32:*.bat​=01;32:*.sh=01;32:*.​csh=01;32:*.tar=01;3​1:*.tgz=01;31:*.arj=​01;31:*.taz=01;31:*.​lzh=01;31:*.zip=01;3​1:*.z=01;31:*.Z=01;3​1:*.gz=01;31:*.bz2=0​1;31:*.bz=01;31:*.tz​=01;31:*.rpm=01;31:*​.cpio=01;31:*.jpg=01​;35:*.gif=01;35:*.bm​p=01;35:*.xbm=01;35:​*.xpm=01;35:*.png=01​;35:*.tif=01;35:'\'​';'
export LS_COLORS
++++
LS_COLORS='no=00:fi=​00:di=01;34:ln=01;36​:pi=40;33:so=01;35:b​d=40;33;01:cd=40;33;​01:or=01;05;37;41:mi​=01;05;37;41:ex=01;3​2:*.cmd=01;32:*.exe=​01;32:*.com=01;32:*.​btm=01;32:*.bat=01;3​2:*.sh=01;32:*.csh=0​1;32:*.tar=01;31:*.t​gz=01;31:*.arj=01;31​:*.taz=01;31:*.lzh=0​1;31:*.zip=01;31:*.z​=01;31:*.Z=01;31:*.g​z=01;31:*.bz2=01;31:​*.bz=01;31:*.tz=01;3​1:*.rpm=01;31:*.cpio​=01;31:*.jpg=01;35:*​.gif=01;35:*.bmp=01;​35:*.xbm=01;35:*.xpm​=01;35:*.png=01;35:*​.tif=01;35:'
++++ export LS_COLORS
+++ '[' -z
'no=00:fi=00:di=01;3​4:ln=01;36:pi=40;33:​so=01;35:bd=40;33;01​:cd=40;33;01:or=01;0​5;37;41:mi=01;05;37;​41:ex=01;32:*.cmd=01​;32:*.exe=01;32:*.co​m=01;32:*.btm=01;32:​*.bat=01;32:*.sh=01;​32:*.csh=01;32:*.tar​=01;31:*.tgz=01;31:*​.arj=01;31:*.taz=01;​31:*.lzh=01;31:*.zip​=01;31:*.z=01;31:*.Z​=01;31:*.gz=01;31:*.​bz2=01;31:*.bz=01;31​:*.tz=01;31:*.rpm=01​;31:*.cpio=01;31:*.j​pg=01;35:*.gif=01;35​:*.bmp=01;35:*.xbm=0​1;35:*.xpm=01;35:*.p​ng=01;35:*.tif=01;35​:'
']'
+++ egrep -qi '^COLOR.*none' /etc/DIR_COLORS
+++ alias 'll=ls -l --color=tty'
+++ alias 'l.=ls -d .* --color=tty'
+++ alias 'ls=ls --color=tty'
++ for i in '/etc/profile.d/*.sh'
++ '[' -r /etc/profile.d/glib2.sh ']'
++ . /etc/profile.d/glib2.sh
+++ export G_BROKEN_FILENAMES=1
+++ G_BROKEN_FILENAMES=1
++ for i in '/etc/profile.d/*.sh'
++ '[' -r /etc/profile.d/krb5.sh ']'
++ . /etc/profile.d/krb5.sh
+++ echo
/usr/kerberos/sbin:/​usr/kerberos/bin:/us​r/local/sbin:/usr/lo​cal/bin:/sbin:/bin:/​usr/sbin:/usr/bin:/u​sr/X11R6/bin:/root/b​in
+++ grep -q /usr/kerberos/bin
+++ echo
/usr/kerberos/sbin:/​usr/kerberos/bin:/us​r/local/sbin:/usr/lo​cal/bin:/sbin:/bin:/​usr/sbin:/usr/bin:/u​sr/X11R6/bin:/root/b​in
+++ grep -q /usr/kerberos/sbin
++ for i in '/etc/profile.d/*.sh'
++ '[' -r /etc/profile.d/lang.sh ']'
++ . /etc/profile.d/lang.sh
+++ sourced=0
+++ for langfile in /etc/sysconfig/i18n '$HOME/.i18n'
+++ '[' -f /etc/sysconfig/i18n ']'
+++ . /etc/sysconfig/i18n
++++ LANG=en_US.UTF-8
++++ SUPPORTED=en_US.UTF-8:en_US:en
++++ SYSFONT=latarcyrheb-sun16
+++ sourced=1
+++ for langfile in /etc/sysconfig/i18n '$HOME/.i18n'
+++ '[' -f /root/.i18n ']'
+++ '[' -n '' ']'
+++ '[' 1 = 1 ']'
+++ '[' -n en_US.UTF-8 ']'
+++ export LANG
+++ '[' -n '' ']'
+++ unset LC_ADDRESS
+++ '[' -n '' ']'
+++ unset LC_CTYPE
+++ '[' -n '' ']'
+++ unset LC_COLLATE
+++ '[' -n '' ']'
+++ unset LC_IDENTIFICATION
+++ '[' -n '' ']'
+++ unset LC_MEASUREMENT
+++ '[' -n '' ']'
+++ unset LC_MESSAGES
+++ '[' -n '' ']'
+++ unset LC_MONETARY
+++ '[' -n '' ']'
+++ unset LC_NAME
+++ '[' -n '' ']'
+++ unset LC_NUMERIC
+++ '[' -n '' ']'
+++ unset LC_PAPER
+++ '[' -n '' ']'
+++ unset LC_TELEPHONE
+++ '[' -n '' ']'
+++ unset LC_TIME
+++ '[' -n '' ']'
+++ unset LC_ALL
+++ '[' -n '' ']'
+++ unset LANGUAGE
+++ '[' -n '' ']'
+++ unset LINGUAS
+++ '[' -n '' ']'
+++ unset _XKB_CHARSET
+++ '[' -n '' ']'
+++ '[' -n '' ']'
+++ '[' -n en_US.UTF-8 ']'
+++ case $LANG in
++++ /sbin/consoletype
+++ '[' xterm-color = linux -a pty = vt ']'
+++ unset SYSFONTACM SYSFONT
+++ unset sourced
+++ unset langfile
++ for i in '/etc/profile.d/*.sh'
++ '[' -r /etc/profile.d/less.sh ']'
++ . /etc/profile.d/less.sh
+++ '[' -x /usr/bin/lesspipe.sh ']'
+++ export 'LESSOPEN=|/usr/bin/lesspipe.sh %s'
+++ LESSOPEN='|/usr/bin/lesspipe.sh %s'
++ for i in '/etc/profile.d/*.sh'
++ '[' -r /etc/profile.d/which-2.sh ']'
++ . /etc/profile.d/which-2.sh
+++ alias 'which=alias | /usr/bin/which --tty-only --read-alias
--show-dot --show-tilde'
++ unset i
+ set -e
+ make -s -C /usr/src/fsvs-1.1.14/tests prepare_clean
make[5]: *** [prepare_wc] Error 1
make[5]: *** [prepare_wc] Error 1
make[4]: *** [prepare_wcs] Error 2
make[3]: *** [prepare_clean] Error 2
----++---- /usr/src/fsvs-1.1.14​/tests/001_init_dir failed ----++----
make[2]: *** [run_tests] Error 1
make[1]: *** [run-tests] Error 2
make: *** [run-tests] Error 2



~~~~~~~~~~~~~~~~~~~~​~~~~~~~~~~~~~~~~~~
When removing /tmp/fsvs-test-0 before:
~~~~~~~~~~~~~~~~~~~~​~~~~~~~~~~~~~~~~~~~

rm -Rvf /tmp/fsvs-test-0
removed directory: `/tmp/fsvs-test-0/export'
removed directory: `/tmp/fsvs-test-0/waa'
removed directory: `/tmp/fsvs-test-0/log'
removed directory: `/tmp/fsvs-test-0/wc-2'
removed directory: `/tmp/fsvs-test-0/wc-1'
removed directory: `/tmp/fsvs-test-0/repos/dav'
removed `/tmp/fsvs-test-0/re​pos/locks/db.lock'
removed `/tmp/fsvs-test-0/re​pos/locks/db-logs.lo​ck'
removed directory: `/tmp/fsvs-test-0/repos/locks'
removed `/tmp/fsvs-test-0/re​pos/README.txt'
removed `/tmp/fsvs-test-0/re​pos/hooks/pre-lock.t​mpl'
removed `/tmp/fsvs-test-0/re​pos/hooks/post-revpr​op-change.tmpl'
removed `/tmp/fsvs-test-0/re​pos/hooks/start-comm​it.tmpl'
removed `/tmp/fsvs-test-0/re​pos/hooks/post-lock.​tmpl'
removed `/tmp/fsvs-test-0/re​pos/hooks/post-unloc​k.tmpl'
removed `/tmp/fsvs-test-0/re​pos/hooks/pre-revpro​p-change.tmpl'
removed `/tmp/fsvs-test-0/re​pos/hooks/pre-unlock​.tmpl'
removed `/tmp/fsvs-test-0/re​pos/hooks/post-commi​t.tmpl'
removed `/tmp/fsvs-test-0/re​pos/hooks/pre-commit​.tmpl'
removed directory: `/tmp/fsvs-test-0/repos/hooks'
removed `/tmp/fsvs-test-0/re​pos/conf/authz'
removed `/tmp/fsvs-test-0/re​pos/conf/svnserve.co​nf'
removed `/tmp/fsvs-test-0/re​pos/conf/passwd'
removed directory: `/tmp/fsvs-test-0/repos/conf'
removed `/tmp/fsvs-test-0/repos/format'
removed `/tmp/fsvs-test-0/re​pos/db/revprops/0'
removed `/tmp/fsvs-test-0/re​pos/db/revprops/1'
removed directory: `/tmp/fsvs-test-0/re​pos/db/revprops'
removed `/tmp/fsvs-test-0/re​pos/db/revs/0'
removed `/tmp/fsvs-test-0/re​pos/db/revs/1'
removed directory: `/tmp/fsvs-test-0/re​pos/db/revs'
removed `/tmp/fsvs-test-0/re​pos/db/uuid'
removed `/tmp/fsvs-test-0/re​pos/db/fs-type'
removed `/tmp/fsvs-test-0/re​pos/db/current'
removed directory: `/tmp/fsvs-test-0/re​pos/db/transactions'​
removed `/tmp/fsvs-test-0/re​pos/db/write-lock'
removed `/tmp/fsvs-test-0/re​pos/db/format'
removed directory: `/tmp/fsvs-test-0/repos/db'
removed directory: `/tmp/fsvs-test-0/repos'
removed `/tmp/fsvs-test-0/conf/config'
removed directory: `/tmp/fsvs-test-0/conf'
removed `/tmp/fsvs-test-0/de​fault-repos.dump'
removed directory: `/tmp/fsvs-test-0'

make run-tests VERBOSE=1
make -C ../tests BINARY=/usr/src/fsvs​-1.1.14/src/fsvs
Preparing default repository.
make[5]: *** [prepare_wc] Error 1
make[5]: *** [prepare_wc] Error 1
make[4]: *** [prepare_wcs] Error 2
make[3]: *** [prepare_clean] Error 2
make[2]: *** [/tmp/fsvs-test-0/de​fault-repos.dump] Error 2
make[1]: *** [run-tests] Error 2
make: *** [run-tests] Error 2

find /tmp/fsvs-test-0/
/tmp/fsvs-test-0/
/tmp/fsvs-test-0/waa
/tmp/fsvs-test-0/log
/tmp/fsvs-test-0/wc-2
/tmp/fsvs-test-0/wc-1
/tmp/fsvs-test-0/repos
/tmp/fsvs-test-0/repos/dav
/tmp/fsvs-test-0/repos/locks
/tmp/fsvs-test-0/rep​os/locks/db.lock
/tmp/fsvs-test-0/rep​os/locks/db-logs.loc​k
/tmp/fsvs-test-0/rep​os/README.txt
/tmp/fsvs-test-0/repos/hooks
/tmp/fsvs-test-0/rep​os/hooks/pre-lock.tm​pl
/tmp/fsvs-test-0/rep​os/hooks/post-revpro​p-change.tmpl
/tmp/fsvs-test-0/rep​os/hooks/start-commi​t.tmpl
/tmp/fsvs-test-0/rep​os/hooks/post-lock.t​mpl
/tmp/fsvs-test-0/rep​os/hooks/post-unlock​.tmpl
/tmp/fsvs-test-0/rep​os/hooks/pre-revprop​-change.tmpl
/tmp/fsvs-test-0/rep​os/hooks/pre-unlock.​tmpl
/tmp/fsvs-test-0/rep​os/hooks/post-commit​.tmpl
/tmp/fsvs-test-0/rep​os/hooks/pre-commit.​tmpl
/tmp/fsvs-test-0/repos/conf
/tmp/fsvs-test-0/rep​os/conf/authz
/tmp/fsvs-test-0/rep​os/conf/svnserve.con​f
/tmp/fsvs-test-0/rep​os/conf/passwd
/tmp/fsvs-test-0/repos/format
/tmp/fsvs-test-0/repos/db
/tmp/fsvs-test-0/rep​os/db/revprops
/tmp/fsvs-test-0/rep​os/db/revprops/0
/tmp/fsvs-test-0/rep​os/db/revprops/1
/tmp/fsvs-test-0/repos/db/revs
/tmp/fsvs-test-0/rep​os/db/revs/0
/tmp/fsvs-test-0/rep​os/db/revs/1
/tmp/fsvs-test-0/repos/db/uuid
/tmp/fsvs-test-0/rep​os/db/fs-type
/tmp/fsvs-test-0/rep​os/db/current
/tmp/fsvs-test-0/rep​os/db/transactions
/tmp/fsvs-test-0/rep​os/db/write-lock
/tmp/fsvs-test-0/rep​os/db/format
/tmp/fsvs-test-0/conf
/tmp/fsvs-test-0/conf/config

« Previous message in topic | 1 of 6 | Next message in topic »

Messages

Show all messages in topic

FSVS 1.1.14 and up and CentOS 4.4: Error on make run-tests benjaminm Benjamin M. 2008-05-01 14:45:48 PDT
     Re: FSVS 1.1.14 and up and CentOS 4.4: Error on make run-tests pmarek P.Marek 2008-05-02 11:55:35 PDT
         Re: FSVS 1.1.14 and up and CentOS 4.4: Error on make run-tests benjaminm Benjamin M. 2008-05-02 13:46:51 PDT
             Re: FSVS 1.1.14 and up and CentOS 4.4: Error on make run-tests pmarek P.Marek 2008-05-06 00:33:11 PDT
                 Re: FSVS 1.1.14 and up and CentOS 4.4: Error on make run-tests benjaminm Benjamin M. 2008-05-07 11:08:52 PDT
                     Re: FSVS 1.1.14 and up and CentOS 4.4: Error on make run-tests pmarek P.Marek 2008-05-08 08:27:34 PDT
Messages per page: