Login | Register
My pages Projects Community openCollabNet

Discussions > dev > Re: FSVS 1.1.14 and up and CentOS 4.4: Error on make run-tests

fsvs
Discussion topic

Back to topic list

Re: FSVS 1.1.14 and up and CentOS 4.4: Error on make run-tests

Author pmarek
Full name P.Marek
Date 2008-05-02 11:55:35 PDT
Message On Thursday 01 May 2008 Benjamin M. wrote:
> Phil,
>
> With versions 1.1.14 and up (no problem with previous
> versions) and CentOS 4.4 (no problem with CentOS 5) I have the following
> error on
>
> $ make run-tests
...
> + make -s -C /usr/src/fsvs-1.1.14/tests prepare_clean
> make[5]: *** [prepare_wc] Error 1
> make[5]: *** [prepare_wc] Error 1
> make[4]: *** [prepare_wcs] Error 2
> make[3]: *** [prepare_clean] Error 2
> ----++---- /usr/src/fsvs-1.1.14​/tests/001_init_dir failed ----++----
> make[2]: *** [run_tests] Error 1
> make[1]: *** [run-tests] Error 2
> make: *** [run-tests] Error 2
Please change all "make -s" in tests/Makefile into "make VERBOSE=1", so that
we see some output, and send me the output of "make run-tests TEST_LIST=001*
VERBOSE=1".

Thank you!

--
Versioning your /etc, /home or even your whole installation?
             Try fsvs (fsvs.tigris.org)!

« Previous message in topic | 2 of 6 | Next message in topic »

Messages

Show all messages in topic

FSVS 1.1.14 and up and CentOS 4.4: Error on make run-tests benjaminm Benjamin M. 2008-05-01 14:45:48 PDT
     Re: FSVS 1.1.14 and up and CentOS 4.4: Error on make run-tests pmarek P.Marek 2008-05-02 11:55:35 PDT
         Re: FSVS 1.1.14 and up and CentOS 4.4: Error on make run-tests benjaminm Benjamin M. 2008-05-02 13:46:51 PDT
             Re: FSVS 1.1.14 and up and CentOS 4.4: Error on make run-tests pmarek P.Marek 2008-05-06 00:33:11 PDT
                 Re: FSVS 1.1.14 and up and CentOS 4.4: Error on make run-tests benjaminm Benjamin M. 2008-05-07 11:08:52 PDT
                     Re: FSVS 1.1.14 and up and CentOS 4.4: Error on make run-tests pmarek P.Marek 2008-05-08 08:27:34 PDT
Messages per page: