Login | Register
My pages Projects Community openCollabNet

Discussions > dev > Re: svn commit: r312 - trunk: . fsvs fsvs/doc fsvs/src fsvs/src/test

fsvs
Discussion topic

Back to topic list

Re: svn commit: r312 - trunk: . fsvs fsvs/doc fsvs/src fsvs/src/test

Author Benjamin Mucci <mucci at perspectives dot qc dot ca>
Full name Benjamin Mucci <mucci at perspectives dot qc dot ca>
Date 2006-05-25 10:10:13 PDT
Message Philipp Marek wrote, On 25/05/06 05:31:
>
>> /devworld/src/fsvs-t​runk/fsvs/src/test/0​08_update_to_rev: line 63:
>> conditional binary operator expected
>> ----++---- /devworld/src/fsvs-t​runk/fsvs/src/test/0​08_update_to_rev
>> failed ----++----
>> make[1]: *** [run_tests] Error 1
>> make[1]: Leaving directory `/devworld/src/fsvs-​trunk/fsvs/src/test'​
>> make: *** [run-tests] Error 2
>>
> How about r313?
>
Nop...

Ben.



# make run-tests TEST_LIST=008* VERBOSE=1

[...]

Updated to revision 2.
13:06:55.476 main[fsvs.c:490] heap=0x8095000
+ VL
+ [[ 1 != '' ]]
+ ls -la --full-time '/tmp/fsvs-test-0/wc/*' '/tmp/fsvs-test-0/wc2/*'
ls: /tmp/fsvs-test-0/wc/*: No such file or directory
ls: /tmp/fsvs-test-0/wc2/*: No such file or directory
+ true
+ [[ -e update-file.upd ]]
+ echo 'Ok, file was deleted'
Ok, file was deleted
++ /devworld/src/fsvs-t​runk/fsvs/src/fsvs remote-status
++ grep update-file.upd
+ [[ '' == \N\m\C\.\ * ]]
+ echo 'NOK, remote-status failed!'
NOK, remote-status failed!
+ exit 1
----++---- /devworld/src/fsvs-t​runk/fsvs/src/test/0​08_update_to_rev failed ----++----
make[1]: *** [run_tests] Error 1
make[1]: Leaving directory `/devworld/src/fsvs-​trunk/fsvs/src/test'​
make: *** [run-tests] Error 2
Attachments

« Previous message in topic | 1 of 1 | Next message in topic »

Messages

Show all messages in topic

Re: svn commit: r312 - trunk: . fsvs fsvs/doc fsvs/src fsvs/src/test Benjamin Mucci <mucci at perspectives dot qc dot ca> Benjamin Mucci <mucci at perspectives dot qc dot ca> 2006-05-25 10:10:13 PDT
Messages per page: