Login | Register
My pages Projects Community openCollabNet

Discussions > dev > direnum.c:146: error: 'NAME_MAX' undeclared here (not in a function)

fsvs
Discussion topic

Back to topic list

direnum.c:146: error: 'NAME_MAX' undeclared here (not in a function)

Author Alexander Skwar <alexanders dot mailinglists+nospam at gmail dot com>
Full name Alexander Skwar <alexanders dot mailinglists+nospam at gmail dot com>
Date 2007-12-07 02:53:49 PST
Message Hi again!

Trying to compile fsvs on S10. It fails:

diff.c:501: warning: format '%d' expects type 'int', but argument 5 has type 'long int'
     CC direnum.c
direnum.c:146: error: 'NAME_MAX' undeclared here (not in a function)
direnum.c: In function 'dir__get_dir_size':
direnum.c:207: warning: label 'ex' defined but not used
gmake[1]: *** [direnum.o] Error 1
gmake: *** [default-target] Error 2

Any ideas? :)

Complete config.log is available at <http://public-files.​askwar.s3.amazonaws.​com/fsvs/config.log​>.

Alexander Skwar

« Previous message in topic | 1 of 3 | Next message in topic »

Messages

Show all messages in topic

direnum.c:146: error: 'NAME_MAX' undeclared here (not in a function) Alexander Skwar <alexanders dot mailinglists+nospam at gmail dot com> Alexander Skwar <alexanders dot mailinglists+nospam at gmail dot com> 2007-12-07 02:53:49 PST
     Re: direnum.c:146: error: 'NAME_MAX' undeclared here (not in a function) pmarek P.Marek 2007-12-07 03:07:17 PST
         Re: direnum.c:146: error: 'NAME_MAX' undeclared here (not in a function) Alexander Skwar <alexanders dot mailinglists+nospam at gmail dot com> Alexander Skwar <alexanders dot mailinglists+nospam at gmail dot com> 2007-12-07 03:27:47 PST
Messages per page: