Login | Register
My pages Projects Community openCollabNet

Discussions > dev > Re: fsvs & MacOS 10.4

fsvs
Discussion topic

Back to topic list

Re: fsvs & MacOS 10.4

Author benjaminm
Full name Benjamin M.
Date 2006-08-19 15:49:20 PDT
Message Philipp Marek wrote, On 18/08/06 11:26:
>> Are you interested by MacOS X (10.4 / Darwin Kernel Version 8.7.0 /
>> PPC)? I can provide you some testing support...
>>
> I'd like to. Doing compatibility stuff at once would be nice ...

Here some preliminary results under MacOS X 10.4 (apr and pcre from
sources) at fsvs revision 389.

Quick and dirty changes in Makefile (FLAGS at ./configure don't
work...)... So:

18c18
< INCS := -idirafter /usr/local/include -idirafter /usr/include
-idirafter /openpkg/include
---
 > INCS := -idirafter /usr/local/apr/include -idirafter
/usr/local/apr/include/apr-0 -idirafter /usr/local/pcre-6.7/include
-idirafter /usr/local/include -idirafter /usr/include -idirafter
/openpkg/include

$ make
cc -Wall -funsigned-char -D_GNU_SOURCE=1 -D_FILE_OFFSET_BITS=64
-D__USE_FILE_OFFSET64 -idirafter /usr/local/apr/include -idirafter
/usr/local/apr/include/apr-0 -idirafter /usr/local/pcre-6.7/include
-idirafter /usr/local/include -idirafter /usr/include -idirafter
/openpkg/include -idirafter /usr/local/include/apr-0 -idirafter
/usr/include/apr-0 -idirafter /openpkg/include/apr-0 -Os
-DFSVS_VERSION='"trunk:389"' -c -o fsvs.o fsvs.c
fsvs.c: In function 'main':
fsvs.c:485: warning: format '%d' expects type 'int', but argument 6 has
type 'long unsigned int'
cc -Wall -funsigned-char -D_GNU_SOURCE=1 -D_FILE_OFFSET_BITS=64
-D__USE_FILE_OFFSET64 -idirafter /usr/local/apr/include -idirafter
/usr/local/apr/include/apr-0 -idirafter /usr/local/pcre-6.7/include
-idirafter /usr/local/include -idirafter /usr/include -idirafter
/openpkg/include -idirafter /usr/local/include/apr-0 -idirafter
/usr/include/apr-0 -idirafter /openpkg/include/apr-0 -Os
-DFSVS_VERSION='"trunk:389"' -c -o ac_list.o ac_list.c
cc -Wall -funsigned-char -D_GNU_SOURCE=1 -D_FILE_OFFSET_BITS=64
-D__USE_FILE_OFFSET64 -idirafter /usr/local/apr/include -idirafter
/usr/local/apr/include/apr-0 -idirafter /usr/local/pcre-6.7/include
-idirafter /usr/local/include -idirafter /usr/include -idirafter
/openpkg/include -idirafter /usr/local/include/apr-0 -idirafter
/usr/include/apr-0 -idirafter /openpkg/include/apr-0 -Os
-DFSVS_VERSION='"trunk:389"' -c -o actions.o actions.c
cc -Wall -funsigned-char -D_GNU_SOURCE=1 -D_FILE_OFFSET_BITS=64
-D__USE_FILE_OFFSET64 -idirafter /usr/local/apr/include -idirafter
/usr/local/apr/include/apr-0 -idirafter /usr/local/pcre-6.7/include
-idirafter /usr/local/include -idirafter /usr/include -idirafter
/openpkg/include -idirafter /usr/local/include/apr-0 -idirafter
/usr/include/apr-0 -idirafter /openpkg/include/apr-0 -Os
-DFSVS_VERSION='"trunk:389"' -c -o add_unvers.o add_unvers.c
cc -Wall -funsigned-char -D_GNU_SOURCE=1 -D_FILE_OFFSET_BITS=64
-D__USE_FILE_OFFSET64 -idirafter /usr/local/apr/include -idirafter
/usr/local/apr/include/apr-0 -idirafter /usr/local/pcre-6.7/include
-idirafter /usr/local/include -idirafter /usr/include -idirafter
/openpkg/include -idirafter /usr/local/include/apr-0 -idirafter
/usr/include/apr-0 -idirafter /openpkg/include/apr-0 -Os
-DFSVS_VERSION='"trunk:389"' -c -o build.o build.c
cc -Wall -funsigned-char -D_GNU_SOURCE=1 -D_FILE_OFFSET_BITS=64
-D__USE_FILE_OFFSET64 -idirafter /usr/local/apr/include -idirafter
/usr/local/apr/include/apr-0 -idirafter /usr/local/pcre-6.7/include
-idirafter /usr/local/include -idirafter /usr/include -idirafter
/openpkg/include -idirafter /usr/local/include/apr-0 -idirafter
/usr/include/apr-0 -idirafter /openpkg/include/apr-0 -Os
-DFSVS_VERSION='"trunk:389"' -c -o checksum.o checksum.c
checksum.c: In function 'cs__read_manber_hashes':
checksum.c:738: warning: implicit declaration of function 'lseek64'
cc -Wall -funsigned-char -D_GNU_SOURCE=1 -D_FILE_OFFSET_BITS=64
-D__USE_FILE_OFFSET64 -idirafter /usr/local/apr/include -idirafter
/usr/local/apr/include/apr-0 -idirafter /usr/local/pcre-6.7/include
-idirafter /usr/local/include -idirafter /usr/include -idirafter
/openpkg/include -idirafter /usr/local/include/apr-0 -idirafter
/usr/include/apr-0 -idirafter /openpkg/include/apr-0 -Os
-DFSVS_VERSION='"trunk:389"' -c -o commit.o commit.c
In file included from commit.c:41:
helper.h:46: warning: 'struct stat64' declared inside parameter list
helper.h:46: warning: its scope is only this definition or declaration,
which is probably not what you want
commit.c: In function 'ci__directory':
commit.c:266: error: storage size of 'dummy_stat64' isn't known
commit.c:341: warning: implicit declaration of function 'lstat64'
commit.c:266: warning: unused variable 'dummy_stat64'
commit.c: In function 'ci__work':
commit.c:489: error: storage size of 'st' isn't known
commit.c:536: warning: implicit declaration of function 'fstat64'
commit.c:489: warning: unused variable 'st'
make: *** [commit.o] Error 1
Attachments

« Previous message in topic | 7 of 29 | Next message in topic »

Messages

Show all messages in topic

                                                         Re: fsvs &amp; openbsd Julien TOUCHE <julien dot touche at lycos dot com> Julien TOUCHE <julien dot touche at lycos dot com> 2006-11-17 08:33:59 PST
                                                             Re: fsvs &amp; openbsd pmarek P.Marek 2006-11-17 09:00:16 PST
                                                             Re: fsvs &amp; openbsd pmarek P.Marek 2006-11-17 10:50:23 PST
                                                                 Re: fsvs &amp; openbsd Julien TOUCHE <julien dot touche at lycos dot com> Julien TOUCHE <julien dot touche at lycos dot com> 2006-11-18 00:25:28 PST
Page: of 2 « Previous | Next »
Messages per page: